=> Bootstrap dependency digest>=20211023: found digest-20220214 ===> Skipping vulnerability checks. WARNING: No /usr/pkg/pkgdb/pkg-vulnerabilities file found. WARNING: To fix run: `/usr/sbin/pkg_admin -K /usr/pkg/pkgdb fetch-pkg-vulnerabilities'. ===> Building for eukleides-1.5.4nb3 Making eukleides Building parser /tmp/pkgbuild/math/eukleides/work/.tools/bin/yacc: /usr/pkg/bin/bison: not found Building circle.o Building compiler.o Building conic.o ../src/common/conic.c:26:10: fatal error: parser.tab.h: No such file or directory 26 | #include "parser.tab.h" | ^~~~~~~~~~~~~~ compilation terminated. distcc[6934] ERROR: compile ../src/common/conic.c on 10.0.20.122:3852 failed distcc[6934] (dcc_build_somewhere) Warning: remote compilation of '../src/common/conic.c' failed, retrying locally distcc[6934] Warning: failed to distribute ../src/common/conic.c to 10.0.20.122:3852, running locally instead ../src/common/conic.c:26:10: fatal error: parser.tab.h: No such file or directory 26 | #include "parser.tab.h" | ^~~~~~~~~~~~~~ compilation terminated. distcc[6934] ERROR: compile ../src/common/conic.c on localhost failed gmake[1]: *** [Makefile:43: eukleides_build/conic.o] Error 1 gmake: *** [Makefile:16: eukleides] Error 2 *** Error code 2 Stop. make[1]: stopped making "all" in /usr/pkgsrc/math/eukleides *** Error code 1 Stop. make: stopped making "all" in /usr/pkgsrc/math/eukleides