=> Bootstrap dependency digest>=20010302: found digest-20190127
===> Building for xf86-video-intel-2.99.917nb7
--- all ---
/usr/bin/make  all-recursive
--- all-recursive ---
Making all in man
--- intel.4 ---
  GEN      intel.4
Making all in libobj
--- ignore.lo ---
  CC       ignore.lo
--- libcompat.la ---
  CCLD     libcompat.la
Making all in xvmc
--- all-recursive ---
Making all in shader
--- all-recursive ---
Making all in mc
--- all ---
/usr/bin/make  all-am
Making all in vld
--- all ---
/usr/bin/make  all-am
Making all in src
--- all-recursive ---
Making all in render_program
--- all ---
/usr/bin/make  all-am
Making all in legacy
--- all-recursive ---
Making all in i810
--- all-recursive ---
Making all in xvmc
--- i810_accel.lo ---
--- i810_cursor.lo ---
--- i810_driver.lo ---
--- i810_memory.lo ---
--- i810_accel.lo ---
  CC       i810_accel.lo
--- i810_cursor.lo ---
  CC       i810_cursor.lo
--- i810_driver.lo ---
  CC       i810_driver.lo
--- i810_memory.lo ---
  CC       i810_memory.lo
--- i810_driver.lo ---
i810_driver.c: In function 'I810PreInit':
i810_driver.c:242:9: warning: variable 'enable' set but not used [-Wunused-but-set-variable]
i810_driver.c: In function 'I810LeaveVT':
i810_driver.c:1889:12: warning: unused variable 'pI810' [-Wunused-variable]
--- i810_video.lo ---
  CC       i810_video.lo
--- i810_wmark.lo ---
  CC       i810_wmark.lo
--- i810_dga.lo ---
  CC       i810_dga.lo
--- i810_video.lo ---
i810_video.c:212:36: warning: initialization discards 'const' qualifier from pointer target type [-Wdiscarded-qualifiers]
i810_video.c:213:29: warning: initialization discards 'const' qualifier from pointer target type [-Wdiscarded-qualifiers]
i810_video.c:214:26: warning: initialization discards 'const' qualifier from pointer target type [-Wdiscarded-qualifiers]
--- liblegacy-i810.la ---
  CCLD     liblegacy-i810.la
--- liblegacy.la ---
  CCLD     liblegacy.la
Making all in sna
--- all-recursive ---
Making all in brw
--- brw_disasm.lo ---
--- brw_eu.lo ---
--- brw_eu_emit.lo ---
--- brw_sf.lo ---
--- brw_disasm.lo ---
  CC       brw_disasm.lo
--- brw_eu.lo ---
  CC       brw_eu.lo
--- brw_eu_emit.lo ---
  CC       brw_eu_emit.lo
--- brw_sf.lo ---
  CC       brw_sf.lo
--- brw_wm.lo ---
  CC       brw_wm.lo
--- brw_test.o ---
  CC       brw_test.o
--- brw_test_gen4.o ---
  CC       brw_test_gen4.o
--- brw_test_gen5.o ---
  CC       brw_test_gen5.o
brw_test_gen5.c:122:23: warning: 'ps_kernel_planar_static' defined but not used [-Wunused-const-variable=]
brw_test_gen5.c:114:23: warning: 'ps_kernel_packed_static' defined but not used [-Wunused-const-variable=]
brw_test_gen5.c:104:23: warning: 'ps_kernel_masknoca_projective' defined but not used [-Wunused-const-variable=]
brw_test_gen5.c:84:23: warning: 'ps_kernel_maskca_srcalpha_projective' defined but not used [-Wunused-const-variable=]
brw_test_gen5.c:74:23: warning: 'ps_kernel_maskca_srcalpha_affine' defined but not used [-Wunused-const-variable=]
brw_test_gen5.c:64:23: warning: 'ps_kernel_maskca_projective' defined but not used [-Wunused-const-variable=]
--- brw_test_gen6.o ---
  CC       brw_test_gen6.o
--- brw_test_gen4.o ---
brw_test_gen4.c:122:23: warning: 'ps_kernel_planar_static' defined but not used [-Wunused-const-variable=]
brw_test_gen4.c:114:23: warning: 'ps_kernel_packed_static' defined but not used [-Wunused-const-variable=]
brw_test_gen4.c:104:23: warning: 'ps_kernel_masknoca_projective' defined but not used [-Wunused-const-variable=]
brw_test_gen4.c:84:23: warning: 'ps_kernel_maskca_srcalpha_projective' defined but not used [-Wunused-const-variable=]
brw_test_gen4.c:74:23: warning: 'ps_kernel_maskca_srcalpha_affine' defined but not used [-Wunused-const-variable=]
brw_test_gen4.c:64:23: warning: 'ps_kernel_maskca_projective' defined but not used [-Wunused-const-variable=]
brw_test_gen4.c:54:23: warning: 'ps_kernel_maskca_affine' defined but not used [-Wunused-const-variable=]
--- brw_test_gen7.o ---
  CC       brw_test_gen7.o
--- brw_test_gen6.o ---
brw_test_gen6.c:105:23: warning: 'ps_kernel_planar' defined but not used [-Wunused-const-variable=]
brw_test_gen6.c:98:23: warning: 'ps_kernel_packed' defined but not used [-Wunused-const-variable=]
brw_test_gen6.c:89:23: warning: 'ps_kernel_masknoca_projective' defined but not used [-Wunused-const-variable=]
brw_test_gen6.c:71:23: warning: 'ps_kernel_maskca_srcalpha_projective' defined but not used [-Wunused-const-variable=]
brw_test_gen6.c:62:23: warning: 'ps_kernel_maskca_srcalpha_affine' defined but not used [-Wunused-const-variable=]
brw_test_gen6.c:53:23: warning: 'ps_kernel_maskca_projective' defined but not used [-Wunused-const-variable=]
brw_test_gen6.c:44:23: warning: 'ps_kernel_maskca_affine' defined but not used [-Wunused-const-variable=]
--- brw_test_gen7.o ---
brw_test_gen7.c:105:23: warning: 'ps_kernel_planar' defined but not used [-Wunused-const-variable=]
brw_test_gen7.c:98:23: warning: 'ps_kernel_packed' defined but not used [-Wunused-const-variable=]
brw_test_gen7.c:89:23: warning: 'ps_kernel_masknoca_projective' defined but not used [-Wunused-const-variable=]
brw_test_gen7.c:71:23: warning: 'ps_kernel_maskca_srcalpha_projective' defined but not used [-Wunused-const-variable=]
brw_test_gen7.c:53:23: warning: 'ps_kernel_maskca_projective' defined but not used [-Wunused-const-variable=]
--- libbrw.la ---
  CCLD     libbrw.la
--- brw_test ---
  CCLD     brw_test
Making all in fb
--- libfb_la-fbarc.lo ---
--- libfb_la-fbbitmap.lo ---
--- libfb_la-fbblt.lo ---
--- libfb_la-fbbltone.lo ---
--- libfb_la-fbarc.lo ---
  CC       libfb_la-fbarc.lo
--- libfb_la-fbbitmap.lo ---
  CC       libfb_la-fbbitmap.lo
--- libfb_la-fbblt.lo ---
  CC       libfb_la-fbblt.lo
--- libfb_la-fbbltone.lo ---
  CC       libfb_la-fbbltone.lo
--- libfb_la-fbclip.lo ---
  CC       libfb_la-fbclip.lo
--- libfb_la-fbcopy.lo ---
  CC       libfb_la-fbcopy.lo
--- libfb_la-fbfill.lo ---
  CC       libfb_la-fbfill.lo
--- libfb_la-fbgc.lo ---
  CC       libfb_la-fbgc.lo
--- libfb_la-fbglyph.lo ---
  CC       libfb_la-fbglyph.lo
--- libfb_la-fbimage.lo ---
  CC       libfb_la-fbimage.lo
--- libfb_la-fbline.lo ---
  CC       libfb_la-fbline.lo
--- libfb_la-fbpict.lo ---
  CC       libfb_la-fbpict.lo
--- libfb_la-fbpoint.lo ---
  CC       libfb_la-fbpoint.lo
--- libfb_la-fbpush.lo ---
  CC       libfb_la-fbpush.lo
--- libfb_la-fbseg.lo ---
  CC       libfb_la-fbseg.lo
--- libfb_la-fbspan.lo ---
  CC       libfb_la-fbspan.lo
--- libfb_la-fbstipple.lo ---
  CC       libfb_la-fbstipple.lo
--- libfb_la-fbtile.lo ---
  CC       libfb_la-fbtile.lo
--- libfb_la-fbutil.lo ---
  CC       libfb_la-fbutil.lo
--- libfb.la ---
  CCLD     libfb.la
--- blt.lo ---
--- kgem.lo ---
--- sna_accel.lo ---
--- sna_acpi.lo ---
--- kgem.lo ---
  CC       kgem.lo
--- blt.lo ---
  CC       blt.lo
--- sna_accel.lo ---
  CC       sna_accel.lo
--- sna_acpi.lo ---
  CC       sna_acpi.lo
--- sna_accel.lo ---
sna_accel.c:120:0: warning: "FontSetPrivate" redefined
 #define FontSetPrivate(font, idx, data) xfont2_font_set_private(font, idx, data)
 
In file included from sna_accel.c:40:0:
/tmp/pkgbuild/x11/xf86-video-intel/work.aarch64/.buildlink/include/X11/fonts/fontstruct.h:135:0: note: this is the location of the previous definition
 #define FontSetPrivate(pFont,n,ptr) ((n) > (pFont)->maxPrivate ? \
 
--- sna_acpi.lo ---
In file included from sna.h:102:0,
                 from sna_acpi.c:40:
sna_damage.h:63:10: warning: 'regparm' attribute directive ignored [-Wattributes]
In file included from sna.h:102:0,
                 from sna_acpi.c:40:
sna_damage.h:90:7: warning: 'regparm' attribute directive ignored [-Wattributes]
In file included from sna.h:102:0,
                 from sna_acpi.c:40:
sna_damage.h:172:8: warning: 'regparm' attribute directive ignored [-Wattributes]
In file included from sna.h:102:0,
                 from sna_acpi.c:40:
sna_damage.h:181:12: warning: 'regparm' attribute directive ignored [-Wattributes]
In file included from sna.h:102:0,
                 from sna_acpi.c:40:
sna_damage.h:191:14: warning: 'regparm' attribute directive ignored [-Wattributes]
In file included from sna.h:103:0,
                 from sna_acpi.c:40:
sna_render.h:32:22: warning: 'regparm' attribute directive ignored [-Wattributes]
sna_render.h:35:9: warning: 'regparm' attribute directive ignored [-Wattributes]
sna_render.h:97:21: warning: 'regparm' attribute directive ignored [-Wattributes]
sna_render.h:100:9: warning: 'regparm' attribute directive ignored [-Wattributes]
sna_render.h:167:9: warning: 'regparm' attribute directive ignored [-Wattributes]
sna_render.h:176:11: warning: 'regparm' attribute directive ignored [-Wattributes]
sna_render.h:179:23: warning: 'regparm' attribute directive ignored [-Wattributes]
sna_render.h:184:8: warning: 'regparm' attribute directive ignored [-Wattributes]
sna_render.h:187:9: warning: 'regparm' attribute directive ignored [-Wattributes]
sna_render.h:197:9: warning: 'regparm' attribute directive ignored [-Wattributes]
sna_render.h:201:11: warning: 'regparm' attribute directive ignored [-Wattributes]
sna_render.h:206:11: warning: 'regparm' attribute directive ignored [-Wattributes]
--- blt.lo ---
distcc[12601] ERROR: compile blt.c on 10.0.20.122:3640 failed
distcc[12601] (dcc_build_somewhere) Warning: remote compilation of 'blt.c' failed, retrying locally
distcc[12601] Warning: failed to distribute blt.c to 10.0.20.122:3640, running locally instead
--- sna_blt.lo ---
  CC       sna_blt.lo
--- blt.lo ---
In file included from sna.h:102:0,
                 from blt.c:32:
sna_damage.h:63:10: warning: 'regparm' attribute directive ignored [-Wattributes]
          RegionPtr region);
          ^~~~~~~~~
sna_damage.h:90:7: warning: 'regparm' attribute directive ignored [-Wattributes]
       const BoxRec *box);
       ^~~~~
sna_damage.h:172:8: warning: 'regparm' attribute directive ignored [-Wattributes]
        RegionPtr region);
        ^~~~~~~~~
sna_damage.h:181:12: warning: 'regparm' attribute directive ignored [-Wattributes]
            const BoxRec *box);
            ^~~~~
sna_damage.h:191:14: warning: 'regparm' attribute directive ignored [-Wattributes]
              int dx, int dy);
              ^~~
In file included from sna.h:103:0,
                 from blt.c:32:
sna_render.h:32:22: warning: 'regparm' attribute directive ignored [-Wattributes]
         const struct sna_composite_rectangles *r);
                      ^~~~~~~~~~~~~~~~~~~~~~~~
sna_render.h:35:9: warning: 'regparm' attribute directive ignored [-Wattributes]
         const BoxRec *box);
         ^~~~~
sna_render.h:97:21: warning: 'regparm' attribute directive ignored [-Wattributes]
        const struct sna_composite_rectangles *r);
                     ^~~~~~~~~~~~~~~~~~~~~~~~
sna_render.h:100:9: warning: 'regparm' attribute directive ignored [-Wattributes]
         float *v);
         ^~~~~
sna_render.h:167:9: warning: 'regparm' attribute directive ignored [-Wattributes]
         float opacity);
         ^~~~~
sna_render.h:176:11: warning: 'regparm' attribute directive ignored [-Wattributes]
           int nbox);
           ^~~
sna_render.h:179:23: warning: 'regparm' attribute directive ignored [-Wattributes]
          const struct sna_composite_spans_op *op);
                       ^~~~~~~~~~~~~~~~~~~~~~
sna_render.h:184:8: warning: 'regparm' attribute directive ignored [-Wattributes]
        float opacity);
        ^~~~~
sna_render.h:187:9: warning: 'regparm' attribute directive ignored [-Wattributes]
         float *v);
         ^~~~~
sna_render.h:197:9: warning: 'regparm' attribute directive ignored [-Wattributes]
         const BoxRec *box);
         ^~~~~
sna_render.h:201:11: warning: 'regparm' attribute directive ignored [-Wattributes]
           int count);
           ^~~
sna_render.h:206:11: warning: 'regparm' attribute directive ignored [-Wattributes]
           int count);
           ^~~
blt.c:230:1: error: target attribute 'inline-all-stringops' is invalid
 {
 ^
blt.c:286:1: error: target attribute 'inline-all-stringops' is invalid
 {
 ^
blt.c:342:1: error: target attribute 'inline-all-stringops' is invalid
 {
 ^
blt.c:411:1: error: target attribute 'inline-all-stringops' is invalid
 {
 ^
blt.c:480:1: error: target attribute 'inline-all-stringops' is invalid
 {
 ^
blt.c:549:1: error: target attribute 'inline-all-stringops' is invalid
 {
 ^
blt.c:618:1: error: target attribute 'inline-all-stringops' is invalid
 {
 ^
blt.c:686:1: error: target attribute 'inline-all-stringops' is invalid
 {
 ^
distcc[12601] ERROR: compile blt.c on localhost failed
*** [blt.lo] Error code 1

make[4]: stopped in /tmp/pkgbuild/x11/xf86-video-intel/work.aarch64/xf86-video-intel-2.99.917/src/sna
--- kgem.lo ---
In file included from sna.h:102:0,
                 from kgem.c:32:
sna_damage.h:63:10: warning: 'regparm' attribute directive ignored [-Wattributes]
In file included from sna.h:102:0,
                 from kgem.c:32:
sna_damage.h:90:7: warning: 'regparm' attribute directive ignored [-Wattributes]
In file included from sna.h:102:0,
                 from kgem.c:32:
sna_damage.h:172:8: warning: 'regparm' attribute directive ignored [-Wattributes]
In file included from sna.h:102:0,
                 from kgem.c:32:
sna_damage.h:181:12: warning: 'regparm' attribute directive ignored [-Wattributes]
In file included from sna.h:102:0,
                 from kgem.c:32:
sna_damage.h:191:14: warning: 'regparm' attribute directive ignored [-Wattributes]
In file included from sna.h:103:0,
                 from kgem.c:32:
sna_render.h:32:22: warning: 'regparm' attribute directive ignored [-Wattributes]
sna_render.h:35:9: warning: 'regparm' attribute directive ignored [-Wattributes]
sna_render.h:97:21: warning: 'regparm' attribute directive ignored [-Wattributes]
sna_render.h:100:9: warning: 'regparm' attribute directive ignored [-Wattributes]
sna_render.h:167:9: warning: 'regparm' attribute directive ignored [-Wattributes]
sna_render.h:176:11: warning: 'regparm' attribute directive ignored [-Wattributes]
sna_render.h:179:23: warning: 'regparm' attribute directive ignored [-Wattributes]
sna_render.h:184:8: warning: 'regparm' attribute directive ignored [-Wattributes]
sna_render.h:187:9: warning: 'regparm' attribute directive ignored [-Wattributes]
sna_render.h:197:9: warning: 'regparm' attribute directive ignored [-Wattributes]
sna_render.h:201:11: warning: 'regparm' attribute directive ignored [-Wattributes]
sna_render.h:206:11: warning: 'regparm' attribute directive ignored [-Wattributes]
kgem.c: In function 'cpu_cache_size__cpuid4':
kgem.c:957:7: warning: variable 'cnt' set but not used [-Wunused-but-set-variable]
--- sna_blt.lo ---
In file included from sna.h:102:0,
                 from sna_blt.c:35:
sna_damage.h:63:10: warning: 'regparm' attribute directive ignored [-Wattributes]
In file included from sna.h:102:0,
                 from sna_blt.c:35:
sna_damage.h:90:7: warning: 'regparm' attribute directive ignored [-Wattributes]
In file included from sna.h:102:0,
                 from sna_blt.c:35:
sna_damage.h:172:8: warning: 'regparm' attribute directive ignored [-Wattributes]
In file included from sna.h:102:0,
                 from sna_blt.c:35:
sna_damage.h:181:12: warning: 'regparm' attribute directive ignored [-Wattributes]
In file included from sna.h:102:0,
                 from sna_blt.c:35:
sna_damage.h:191:14: warning: 'regparm' attribute directive ignored [-Wattributes]
In file included from sna.h:103:0,
                 from sna_blt.c:35:
sna_render.h:32:22: warning: 'regparm' attribute directive ignored [-Wattributes]
sna_render.h:35:9: warning: 'regparm' attribute directive ignored [-Wattributes]
sna_render.h:97:21: warning: 'regparm' attribute directive ignored [-Wattributes]
sna_render.h:100:9: warning: 'regparm' attribute directive ignored [-Wattributes]
sna_render.h:167:9: warning: 'regparm' attribute directive ignored [-Wattributes]
sna_render.h:176:11: warning: 'regparm' attribute directive ignored [-Wattributes]
sna_render.h:179:23: warning: 'regparm' attribute directive ignored [-Wattributes]
sna_render.h:184:8: warning: 'regparm' attribute directive ignored [-Wattributes]
sna_render.h:187:9: warning: 'regparm' attribute directive ignored [-Wattributes]
sna_render.h:197:9: warning: 'regparm' attribute directive ignored [-Wattributes]
sna_render.h:201:11: warning: 'regparm' attribute directive ignored [-Wattributes]
sna_render.h:206:11: warning: 'regparm' attribute directive ignored [-Wattributes]
sna_blt.c:923:1: warning: 'regparm' attribute directive ignored [-Wattributes]
sna_blt.c:951:1: warning: 'regparm' attribute directive ignored [-Wattributes]
sna_blt.c:985:1: warning: 'regparm' attribute directive ignored [-Wattributes]
sna_blt.c:1026:1: warning: 'regparm' attribute directive ignored [-Wattributes]
sna_blt.c:1175:1: warning: 'regparm' attribute directive ignored [-Wattributes]
sna_blt.c:1265:1: warning: 'regparm' attribute directive ignored [-Wattributes]
sna_blt.c:1381:1: warning: 'regparm' attribute directive ignored [-Wattributes]
sna_blt.c:1387:1: warning: 'regparm' attribute directive ignored [-Wattributes]
sna_blt.c:1515:1: warning: 'regparm' attribute directive ignored [-Wattributes]
sna_blt.c:1561:1: warning: 'regparm' attribute directive ignored [-Wattributes]
sna_blt.c:1876:1: warning: 'regparm' attribute directive ignored [-Wattributes]
sna_blt.c:1923:1: warning: 'regparm' attribute directive ignored [-Wattributes]
sna_blt.c:2015:1: warning: 'regparm' attribute directive ignored [-Wattributes]
sna_blt.c:2033:1: warning: 'regparm' attribute directive ignored [-Wattributes]
sna_blt.c:2072:1: warning: 'regparm' attribute directive ignored [-Wattributes]
sna_blt.c:2092:1: warning: 'regparm' attribute directive ignored [-Wattributes]
sna_blt.c:2133:1: warning: 'regparm' attribute directive ignored [-Wattributes]
sna_blt.c:2176:1: warning: 'regparm' attribute directive ignored [-Wattributes]
sna_blt.c:2256:1: warning: 'regparm' attribute directive ignored [-Wattributes]
sna_blt.c:2303:1: warning: 'regparm' attribute directive ignored [-Wattributes]
sna_blt.c:3078:1: warning: 'regparm' attribute directive ignored [-Wattributes]
sna_blt.c:3096:1: warning: 'regparm' attribute directive ignored [-Wattributes]
sna_blt.c:3127:1: warning: 'regparm' attribute directive ignored [-Wattributes]
--- sna_accel.lo ---
In file included from sna.h:102:0,
                 from sna_accel.c:32:
sna_damage.h:63:10: warning: 'regparm' attribute directive ignored [-Wattributes]
In file included from sna.h:102:0,
                 from sna_accel.c:32:
sna_damage.h:90:7: warning: 'regparm' attribute directive ignored [-Wattributes]
In file included from sna.h:102:0,
                 from sna_accel.c:32:
sna_damage.h:172:8: warning: 'regparm' attribute directive ignored [-Wattributes]
In file included from sna.h:102:0,
                 from sna_accel.c:32:
sna_damage.h:181:12: warning: 'regparm' attribute directive ignored [-Wattributes]
In file included from sna.h:102:0,
                 from sna_accel.c:32:
sna_damage.h:191:14: warning: 'regparm' attribute directive ignored [-Wattributes]
In file included from sna.h:103:0,
                 from sna_accel.c:32:
sna_render.h:32:22: warning: 'regparm' attribute directive ignored [-Wattributes]
sna_render.h:35:9: warning: 'regparm' attribute directive ignored [-Wattributes]
sna_render.h:97:21: warning: 'regparm' attribute directive ignored [-Wattributes]
sna_render.h:100:9: warning: 'regparm' attribute directive ignored [-Wattributes]
sna_render.h:167:9: warning: 'regparm' attribute directive ignored [-Wattributes]
sna_render.h:176:11: warning: 'regparm' attribute directive ignored [-Wattributes]
sna_render.h:179:23: warning: 'regparm' attribute directive ignored [-Wattributes]
sna_render.h:184:8: warning: 'regparm' attribute directive ignored [-Wattributes]
sna_render.h:187:9: warning: 'regparm' attribute directive ignored [-Wattributes]
sna_render.h:197:9: warning: 'regparm' attribute directive ignored [-Wattributes]
sna_render.h:201:11: warning: 'regparm' attribute directive ignored [-Wattributes]
sna_render.h:206:11: warning: 'regparm' attribute directive ignored [-Wattributes]
sna_accel.c: In function 'sna_poly_zero_line_blt':
sna_accel.c:9133:10: warning: variable 'intersects' set but not used [-Wunused-but-set-variable]
sna_accel.c:9033:6: warning: variable 'degenerate' set but not used [-Wunused-but-set-variable]
sna_accel.c: In function 'sna_accel_post_damage':
sna_accel.c:17392:7: warning: assignment from incompatible pointer type [-Wincompatible-pointer-types]
sna_accel.c: In function 'migrate_dirty_tracking':
sna_accel.c:17639:18: warning: comparison of distinct pointer types lacks a cast
sna_accel.c:17655:14: warning: assignment from incompatible pointer type [-Wincompatible-pointer-types]
1 error

make[4]: stopped in /tmp/pkgbuild/x11/xf86-video-intel/work.aarch64/xf86-video-intel-2.99.917/src/sna
*** [all-recursive] Error code 1

make[3]: stopped in /tmp/pkgbuild/x11/xf86-video-intel/work.aarch64/xf86-video-intel-2.99.917/src/sna
1 error

make[3]: stopped in /tmp/pkgbuild/x11/xf86-video-intel/work.aarch64/xf86-video-intel-2.99.917/src/sna
*** [all-recursive] Error code 1

make[2]: stopped in /tmp/pkgbuild/x11/xf86-video-intel/work.aarch64/xf86-video-intel-2.99.917/src
1 error

make[2]: stopped in /tmp/pkgbuild/x11/xf86-video-intel/work.aarch64/xf86-video-intel-2.99.917/src
*** [all-recursive] Error code 1

make[1]: stopped in /tmp/pkgbuild/x11/xf86-video-intel/work.aarch64/xf86-video-intel-2.99.917
1 error

make[1]: stopped in /tmp/pkgbuild/x11/xf86-video-intel/work.aarch64/xf86-video-intel-2.99.917
*** [all] Error code 2

make: stopped in /tmp/pkgbuild/x11/xf86-video-intel/work.aarch64/xf86-video-intel-2.99.917
1 error

make: stopped in /tmp/pkgbuild/x11/xf86-video-intel/work.aarch64/xf86-video-intel-2.99.917
*** Error code 2

Stop.
make[1]: stopped in /usr/pkgsrc/x11/xf86-video-intel
*** Error code 1

Stop.
make: stopped in /usr/pkgsrc/x11/xf86-video-intel